Target
Somatostatin receptor type 1
Ligand
BDBM82459
Substrate
Ki
1000±n/a nM
Comments
PDSP_387
Citation
 Hoyer, DLübbert, HBruns, C Molecular pharmacology of somatostatin receptors. Naunyn Schmiedebergs Arch Pharmacol 350:441-53 (1994)  
Target
Name:
Somatostatin receptor type 1
Synonyms:
SOMATOSTATIN SST1 SS-1-R SS1R SSTR1 | Somatostatin receptor type 1 (SSTR1)
Type:
Enzyme
Mol. Mass.:
42692.81
Organism:
Homo sapiens (Human)
Description:
P30872
Residue:
391
  
Inhibitor
Name:
BDBM82459
Synonyms:
BIM 23058 D-Phe-L-Phe-L-Tyr-D-Trp-L-Lys-L-Val-L-Phe-L-Thr-NH2
Type:
Small organic molecule
Emp. Form.:
C62H77N11O10
Mol. Mass.:
1136.3425
SMILES:
CC(C)[C@H](NC(=O)[C@H](CCCCN)NC(=O)[C@@H](Cc1c[nH]c2ccccc12)NC(=O)[C@H](Cc1ccc(O)cc1)NC(=O)[C@H](Cc1ccccc1)NC(=O)[C@H](N)Cc1ccccc1)C(=O)N[C@@H](Cc1ccccc1)C(=O)N[C@@H]([C@@H](C)O)C(N)=O
: