Target
Somatostatin receptor type 5
Ligand
BDBM82459
Substrate
Ki
1.20±n/a nM
Comments
PDSP_387
Citation
 Hoyer, DLübbert, HBruns, C Molecular pharmacology of somatostatin receptors. Naunyn Schmiedebergs Arch Pharmacol 350:441-53 (1994)  
Target
Name:
Somatostatin receptor type 5
Synonyms:
SOMATOSTATIN SST5 Somatostatin receptor Sstr5
Type:
Enzyme Catalytic Domain
Mol. Mass.:
39986.50
Organism:
RAT
Description:
SOMATOSTATIN SST5 SSTR5 RAT::P30938
Residue:
363
  
Inhibitor
Name:
BDBM82459
Synonyms:
BIM 23058 D-Phe-L-Phe-L-Tyr-D-Trp-L-Lys-L-Val-L-Phe-L-Thr-NH2
Type:
Small organic molecule
Emp. Form.:
C62H77N11O10
Mol. Mass.:
1136.3425
SMILES:
CC(C)[C@H](NC(=O)[C@H](CCCCN)NC(=O)[C@@H](Cc1c[nH]c2ccccc12)NC(=O)[C@H](Cc1ccc(O)cc1)NC(=O)[C@H](Cc1ccccc1)NC(=O)[C@H](N)Cc1ccccc1)C(=O)N[C@@H](Cc1ccccc1)C(=O)N[C@@H]([C@@H](C)O)C(N)=O
: