Target
Alpha-2B adrenergic receptor
Ligand
BDBM35234
Substrate
Ki
28.18±n/a nM
Comments
PDSP_1348
Citation
 O'Rourke, MFBlaxall, HSIversen, LJBylund, DB Characterization of [3H]RX821002 binding to alpha-2 adrenergic receptor subtypes. J Pharmacol Exp Ther 268:1362-7 (1994) Target
Name:
Alpha-2B adrenergic receptor
Synonyms:
ADA2B_DIDVI Alpha-2B adrenergic receptor | adrenergic Alpha2
Type:
Enzyme Catalytic Domain
Mol. Mass.:
41875.91
Organism:
OPOSSUM
Description:
adrenergic Alpha2 0 OPOSSUM::O77715
Residue:
382
  
Inhibitor
Name:
BDBM35234
Synonyms:
DL-[7-3H]norepinephrine Noradrenaline,(+) | [3H]NE
Type:
radiolabeled ligand
Emp. Form.:
C8H11NO3
Mol. Mass.:
169.1778
SMILES:
NCC(O)c1ccc(O)c(O)c1
: