Target
Gamma-aminobutyric acid receptor subunit alpha-1
Ligand
BDBM82505
Substrate
Ki
>10000±n/a nM
Comments
PDSP_1672
Citation
 Wardle, KAEllis, ESBaxter, GSKennett, GAGaster, LMSanger, GJ The effects of SB 204070, a highly potent and selective 5-HT4 receptor antagonist, on guinea-pig distal colon. Br J Pharmacol 112:789-94 (1994)  
Target
Name:
Gamma-aminobutyric acid receptor subunit alpha-1
Synonyms:
Benzodiazepine central GABA A Benzodiazepine liver GABA(A) receptor subunit alpha-1 GABA-A receptor GBRA1_HUMAN TBPS | agonist GABA site
Type:
Protein
Mol. Mass.:
51817.35
Organism:
Homo sapiens (Human)
Description:
P14867
Residue:
456
  
Inhibitor
Name:
BDBM82505
Synonyms:
CAS_121881 SB204070
Type:
Small organic molecule
Emp. Form.:
C19H27ClN2O4
Mol. Mass.:
382.882
SMILES:
CCCCN1CCC(COC(=O)c2cc(Cl)c(N)c3OCCOc23)CC1
: