Target
5-hydroxytryptamine receptor 1D
Ligand
BDBM21342
Substrate
Ki
12.58±n/a nM
Comments
PDSP_1091
Citation
 Boess, FGMartin, IL Molecular biology of 5-HT receptors. Neuropharmacology 33:275-317 (1994)  
Target
Name:
5-hydroxytryptamine receptor 1D
Synonyms:
5-HT1D 5HT1D_CANLF RDC4
Type:
Enzyme Catalytic Domain
Mol. Mass.:
41894.67
Organism:
Dog
Description:
5-HT1D HTR1D Dog::P11614
Residue:
377
  
Inhibitor
Name:
BDBM21342
Synonyms:
(4R,7R)-N,N-diethyl-6-methyl-6,11-diazatetracyclo[7.6.1.0^{2,7}.0^{12,16}]hexadeca-1(16),2,9,12,14-pentaene-4-carboxamide LSD LSD,(+) Lysergic Acid Diethylamide [3H]-LSD | d-Isolysergic acid amide
Type:
radiolabeled ligand
Emp. Form.:
C20H25N3O
Mol. Mass.:
323.432
SMILES:
[H][C@@]12Cc3c[nH]c4cccc(C1=C[C@H](CN2C)C(=O)N(CC)CC)c34
: