Target
5-hydroxytryptamine receptor 1D
Ligand
BDBM50031942
Substrate
Ki
7.76±n/a nM
Comments
PDSP_1230
Citation
 Boess, FGMartin, IL Molecular biology of 5-HT receptors. Neuropharmacology 33:275-317 (1994)  
Target
Name:
5-hydroxytryptamine receptor 1D
Synonyms:
5-HT1D 5HT1D_CANLF RDC4
Type:
Enzyme Catalytic Domain
Mol. Mass.:
41894.67
Organism:
Dog
Description:
5-HT1D HTR1D Dog::P11614
Residue:
377
  
Inhibitor
Name:
BDBM50031942
Synonyms:
(6aR,9R)-4,6a,7-Trimethyl-4,6,6a,7,8,9-hexahydro-indolo[4,3-fg]quinoline-9-carboxylic acid (1-hydroxymethyl-propyl)-amide (6aR,9R)-4-Methyl-4,6,6a,7,8,9-hexahydro-indolo[4,3-fg]quinoline-9-carboxylic acid (1-hydroxymethyl-propyl)-amide (methylsergide)4,7-Dimethyl-4,6,6a,7,8,9-hexahydro-indolo[4,3-fg]quinoline-9-carboxylic acid (1-hydroxymethyl-propyl)-amide CHEMBL1065 Sansert
Type:
Small organic molecule
Emp. Form.:
C21H27N3O2
Mol. Mass.:
353.458
SMILES:
CC[C@@H](CO)NC(=O)[C@H]1CN(C)[C@@H]2Cc3cn(C)c4cccc(C2=C1)c34
: