Target
5-hydroxytryptamine receptor 1D
Ligand
BDBM50024210
Substrate
Ki
346.73±n/a nM
Comments
PDSP_1920
Citation
 Boess, FGMartin, IL Molecular biology of 5-HT receptors. Neuropharmacology 33:275-317 (1994)  
Target
Name:
5-hydroxytryptamine receptor 1D
Synonyms:
5-HT1D 5HT1D_CANLF RDC4
Type:
Enzyme Catalytic Domain
Mol. Mass.:
41894.67
Organism:
Dog
Description:
5-HT1D HTR1D Dog::P11614
Residue:
377
  
Inhibitor
Name:
BDBM50024210
Synonyms:
1H-indole-3-ethanamine 2-(3-indolyl)ethylamine tryptamine
Type:
Small organic molecule
Emp. Form.:
C10H12N2
Mol. Mass.:
160.2157
SMILES:
NCCc1c[nH]c2ccccc12
: