Target
5-hydroxytryptamine receptor 1E
Ligand
BDBM50007407
Substrate
Ki
208.92±n/a nM
Comments
PDSP_32
Citation
 Boess, FGMartin, IL Molecular biology of 5-HT receptors. Neuropharmacology 33:275-317 (1994)  
Target
Name:
5-hydroxytryptamine receptor 1E
Synonyms:
5-HT-1E 5-Hydroxytryptamine Receptor Subtype 1E (5HT1E) 5-hydroxytryptamine receptor 1E (5-HT-1E) (S31) 5HT1E_HUMAN S31 Serotonin 1e (5-HT1e) receptor | Serotonin Receptor 1E
Type:
G Protein-Coupled Receptor (GPCR)
Mol. Mass.:
41697.80
Organism:
Homo sapiens (Human)
Description:
gi_112822
Residue:
365
  
Inhibitor
Name:
BDBM50007407
Synonyms:
1-NP 4-Naphthalen-1-yl-piperazin-1-ium | CHEMBL277120
Type:
Small organic molecule
Emp. Form.:
C14H16N2
Mol. Mass.:
212.2902
SMILES:
C1CN(CCN1)c1cccc2ccccc12
: