Target
5-hydroxytryptamine receptor 1F
Ligand
BDBM50007407
Substrate
Ki
53.7±n/a nM
Comments
PDSP_32
Citation
 Boess, FGMartin, IL Molecular biology of 5-HT receptors. Neuropharmacology 33:275-317 (1994)  
Target
Name:
5-hydroxytryptamine receptor 1F
Synonyms:
5-HT-1F 5-hydroxytryptamine receptor 1F HTR1EL Serotonin (5-HT) receptor Serotonin receptor 1F
Type:
Enzyme Catalytic Domain
Mol. Mass.:
41724.68
Organism:
Homo sapiens (Human)
Description:
5-HT1F HTR1F HUMAN::P30939
Residue:
366
  
Inhibitor
Name:
BDBM50007407
Synonyms:
1-NP 4-Naphthalen-1-yl-piperazin-1-ium | CHEMBL277120
Type:
Small organic molecule
Emp. Form.:
C14H16N2
Mol. Mass.:
212.2902
SMILES:
C1CN(CCN1)c1cccc2ccccc12
: