Target
5-hydroxytryptamine receptor 2B
Ligand
BDBM50017721
Substrate
Ki
22.38±n/a nM
Comments
PDSP_606
Citation
 Boess, FGMartin, IL Molecular biology of 5-HT receptors. Neuropharmacology 33:275-317 (1994)  
Target
Name:
5-hydroxytryptamine receptor 2B
Synonyms:
5-HT2 5-hydroxytryptamine receptor 2B 5HT2B_MOUSE Htr2b
Type:
Enzyme
Mol. Mass.:
53610.91
Organism:
Mus musculus (Mouse)
Description:
Q02152
Residue:
479
  
Inhibitor
Name:
BDBM50017721
Synonyms:
1-Methyl-4-(5H-dibenzo(a,d)cycloheptenylidene)piperidine 4-(5-dibenzo(a,d)cyclohepten-5-ylidine)-1-methylpiperidine 4-(5H-dibenzo[a,d][7]annulen-5-ylidene)-1-methylpiperidine4-(5H-dibenzo[a,d]cyclohepten-5-ylidene)-1-methylpiperidine CHEMBL516 | CYPROHEPTADINE
Type:
Small organic molecule
Emp. Form.:
C21H21N
Mol. Mass.:
287.3981
SMILES:
[#6]-[#7]-1-[#6]-[#6]\[#6](-[#6]-[#6]-1)=[#6]-1/c2ccccc2-[#6]=[#6]-c2ccccc-12
: