Target
Muscarinic acetylcholine receptor M2
Ligand
BDBM50079527
Substrate
Ki
160±n/a nM
Comments
PDSP_735
Citation
 Stanton, TBolden-Watson, CCusack, BRichelson, E Antagonism of the five cloned human muscarinic cholinergic receptors expressed in CHO-K1 cells by antidepressants and antihistaminics. Biochem Pharmacol 45:2352-4 (1993)  
Target
Name:
Muscarinic acetylcholine receptor M2
Synonyms:
ACM2_HUMAN Cholinergic, muscarinic M2 Muscarinic acetylcholine receptor M2 and M5 | RecName: Full=Muscarinic acetylcholine receptor M2
Type:
GPCR
Mol. Mass.:
51730.61
Organism:
Homo sapiens (Human)
Description:
P08172
Residue:
466
  
Inhibitor
Name:
BDBM50079527
Synonyms:
(3E)-3-dibenzo[b,e]oxepin-11(6H)-ylidene-N,N-dimethylpropan-1-amine(3Z)-3-dibenzo[b,e]oxepin-11(6H)-ylidene-N,N-dimethylpropan-1-amine DOXEPIN | cis-doxepin
Type:
Small organic molecule
Emp. Form.:
C19H21NO
Mol. Mass.:
279.3761
SMILES:
CN(C)CC\C=C1\c2ccccc2COc2ccccc12
: