Target
5-hydroxytryptamine receptor 3A
Ligand
BDBM81982
Substrate
Ki
57.8±n/a nM
Comments
PDSP_760
Citation
 Bonhaus, DWLoury, DNJakeman, LBTo, ZDeSouza, AEglen, RMWong, EH [3H]BIMU-1, a 5-hydroxytryptamine3 receptor ligand in NG-108 cells, selectively labels sigma-2 binding sites in guinea pig hippocampus. J Pharmacol Exp Ther 267:961-70 (1993) Target
Name:
5-hydroxytryptamine receptor 3A
Synonyms:
5-HT3 5HT3A_CAVPO HTR3 Serotonin 3a (5-HT3a) receptor
Type:
Enzyme Catalytic Domain
Mol. Mass.:
55657.07
Organism:
GUINEA PIG
Description:
5-HT3 HTR3A GUINEA PIG::O70212
Residue:
490
  
Inhibitor
Name:
BDBM81982
Synonyms:
CAS_97-39-2 DTG Tol2Gdn | cid_7333
Type:
Small organic molecule
Emp. Form.:
C15H17N3
Mol. Mass.:
239.3156
SMILES:
Cc1ccccc1NC(N)=Nc1ccccc1C
: