Target
5-hydroxytryptamine receptor 3A
Ligand
BDBM50000492
Substrate
Ki
>10000±n/a nM
Comments
PDSP_1989
Citation
 Bonhaus, DWLoury, DNJakeman, LBTo, ZDeSouza, AEglen, RMWong, EH [3H]BIMU-1, a 5-hydroxytryptamine3 receptor ligand in NG-108 cells, selectively labels sigma-2 binding sites in guinea pig hippocampus. J Pharmacol Exp Ther 267:961-70 (1993) Target
Name:
5-hydroxytryptamine receptor 3A
Synonyms:
5-HT3 5HT3A_CAVPO HTR3 Serotonin 3a (5-HT3a) receptor
Type:
Enzyme Catalytic Domain
Mol. Mass.:
55657.07
Organism:
GUINEA PIG
Description:
5-HT3 HTR3A GUINEA PIG::O70212
Residue:
490
  
Inhibitor
Name:
BDBM50000492
Synonyms:
(zacopride)4-Amino-N-(1-aza-bicyclo[2.2.2]oct-3-yl)-5-chloro-2-methoxy-benzamide 4-Amino-N-(1-aza-bicyclo[2.2.2]oct-3-yl)-5-chloro-2-methoxy-benzamide (Zacopride) CHEMBL18041 ZACOPRIDE ZACOPRIDE,RS | ZACOPRIDE,S
Type:
Small organic molecule
Emp. Form.:
C15H20ClN3O2
Mol. Mass.:
309.791
SMILES:
COc1cc(N)c(Cl)cc1C(=O)NC1CN2CCC1CC2
: