Target
Toll-like receptor 9
Ligand
BDBM54510
Substrate
Meas. Tech.
Fluorescence-based cell-based high throughput dose response assay for inhibitors of TLR9-MyD88 binding
IC50
6676±n/a nM
Citation
 PubChem, PC Fluorescence-based cell-based high throughput dose response assay for inhibitors of TLR9-MyD88 binding PubChem Bioassay (2011)[AID] 
Target
Name:
Toll-like receptor 9
Synonyms:
CD_antigen: CD289 TLR9_HUMAN
Type:
Enzyme
Mol. Mass.:
115889.91
Organism:
Homo sapiens (Human)
Description:
Q9NR96
Residue:
1032
  
Inhibitor
Name:
BDBM54510
Synonyms:
5-chloranyl-N-[4-[ethyl(phenyl)sulfamoyl]phenyl]-2-methylsulfonyl-pyrimidine-4-carboxamide 5-chloro-N-[4-[ethyl(phenyl)sulfamoyl]phenyl]-2-methylsulfonyl-4-pyrimidinecarboxamide MLS001116357 cid_16012863
Type:
Small organic molecule
Emp. Form.:
C20H19ClN4O5S2
Mol. Mass.:
494.972
SMILES:
CCN(c1ccccc1)S(=O)(=O)c1ccc(NC(=O)c2nc(ncc2Cl)S(C)(=O)=O)cc1
: