Target
Apoptotic protease-activating factor 1
Ligand
BDBM71269
Substrate
Meas. Tech.
Dose Response validation of Inhibitors of Apaf-1 using a Fluorescent Interference Counterscreen assay
IC50
>100000±0 nM
Citation
 PubChem, PC Dose Response validation of Inhibitors of Apaf-1 using a Fluorescent Interference Counterscreen assay PubChem Bioassay (2011)[AID] 
Target
Name:
Apoptotic protease-activating factor 1
Synonyms:
APAF1 Apoptotic peptidase activating factor 1 | KIAA0413
Type:
Enzyme Catalytic Domain
Mol. Mass.:
141834.40
Organism:
Homo sapiens (Human)
Description:
O14727
Residue:
1248
  
Inhibitor
Name:
BDBM71269
Synonyms:
3-(2,5-dimethoxyanilino)-2H-isoquinolin-1-one 3-[(2,5-dimethoxyphenyl)amino]-2H-isoquinolin-1-one SMR000472265 | cid_16727388
Type:
Small organic molecule
Emp. Form.:
C17H16N2O3
Mol. Mass.:
296.3205
SMILES:
COc1ccc(OC)c(Nc2cc3ccccc3c(=O)[nH]2)c1
: