Target
Potassium voltage-gated channel subfamily KQT member 2
Ligand
BDBM77218
Substrate
Meas. Tech.
Dose response assay for compounds that inhibit KCNQ2 potassium channels on automated electrophysiological assay II
IC50
1514.07±81.81 nM
Citation
 PubChem, PC Dose response assay for compounds that inhibit KCNQ2 potassium channels on automated electrophysiological assay II PubChem Bioassay (2011)[AID] 
Target
Name:
Potassium voltage-gated channel subfamily KQT member 2
Synonyms:
KCNQ2_RAT Voltage-gated potassium channel subunit Kv7.2 | potassium voltage-gated channel, KQT-like subfamily, member 2
Type:
PROTEIN
Mol. Mass.:
93984.01
Organism:
Rattus norvegicus
Description:
EBI_100117
Residue:
852
  
Inhibitor
Name:
BDBM77218
Synonyms:
2-[(5-methyl-2-p-phenetyl-oxazol-4-yl)methylthio]-N-tetralin-1-yl-acetamide 2-[[2-(4-ethoxyphenyl)-5-methyl-1,3-oxazol-4-yl]methylsulfanyl]-N-(1,2,3,4-tetrahydronaphthalen-1-yl)ethanamide MLS000521219 cid_4174239
Type:
Small organic molecule
Emp. Form.:
C25H28N2O3S
Mol. Mass.:
436.566
SMILES:
CCOc1ccc(cc1)-c1nc(CSCC(=O)NC2CCCc3ccccc23)c(C)o1
: