Target
Potassium voltage-gated channel subfamily KQT member 2
Ligand
BDBM84176
Substrate
Meas. Tech.
Dose response assay for compounds that inhibit KCNQ2 potassium channels on automated electrophysiological assay II
IC50
92.25±43.07 nM
Citation
 PubChem, PC Dose response assay for compounds that inhibit KCNQ2 potassium channels on automated electrophysiological assay II PubChem Bioassay (2011)[AID] 
Target
Name:
Potassium voltage-gated channel subfamily KQT member 2
Synonyms:
KCNQ2_RAT Voltage-gated potassium channel subunit Kv7.2 | potassium voltage-gated channel, KQT-like subfamily, member 2
Type:
PROTEIN
Mol. Mass.:
93984.01
Organism:
Rattus norvegicus
Description:
EBI_100117
Residue:
852
  
Inhibitor
Name:
BDBM84176
Synonyms:
2-[benzenesulfonyl(methyl)amino]-N-(2-methylphenyl)benzamide MLS001178951 SMR000476387 | cid_1006749
Type:
Small organic molecule
Emp. Form.:
C21H20N2O3S
Mol. Mass.:
380.46
SMILES:
CN(c1ccccc1C(=O)Nc1ccccc1C)S(=O)(=O)c1ccccc1
: