Target
Potassium voltage-gated channel subfamily KQT member 2
Ligand
BDBM84184
Substrate
Meas. Tech.
Dose response assay for compounds that inhibit KCNQ2 potassium channels on automated electrophysiological assay II
IC50
160.66±14.84 nM
Citation
 PubChem, PC Dose response assay for compounds that inhibit KCNQ2 potassium channels on automated electrophysiological assay II PubChem Bioassay (2011)[AID] 
Target
Name:
Potassium voltage-gated channel subfamily KQT member 2
Synonyms:
KCNQ2_RAT Voltage-gated potassium channel subunit Kv7.2 | potassium voltage-gated channel, KQT-like subfamily, member 2
Type:
PROTEIN
Mol. Mass.:
93984.01
Organism:
Rattus norvegicus
Description:
EBI_100117
Residue:
852
  
Inhibitor
Name:
BDBM84184
Synonyms:
2-phenyl-N-(2-pyrrolidin-1-ylphenyl)butanamide 2-phenyl-N-[2-(1-pyrrolidinyl)phenyl]butanamide SMR000688922 | cid_24248347
Type:
Small organic molecule
Emp. Form.:
C20H24N2O
Mol. Mass.:
308.4174
SMILES:
CCC(C(=O)Nc1ccccc1N1CCCC1)c1ccccc1
: