Target
Fibroblast growth factor receptor 1
Ligand
BDBM84518
Substrate
Meas. Tech.
Inhibition Assay
IC50
3e+3± 1.6e+3 nM
Citation
 Gourzoulidou, ECarpintero, MBaumhof, PGiannis, AWaldmann, H Inhibition of angiogenesis-relevant receptor tyrosine kinases by sulindac analogues. Chembiochem 6:527-31 (2005)  
Target
Name:
Fibroblast growth factor receptor 1
Synonyms:
BFGFR Basic fibroblast growth factor receptor 1 (FGFR1) CEK FGFR-1 FGFR-1, (FL) FGFR1_HUMAN FLT2 Fibroblast growth factor receptor 1 (FGFR-1) Fms-like tyrosine kinase 2 N-sam bFGF-R | c-fgr
Type:
Receptor
Mol. Mass.:
91861.70
Organism:
Homo sapiens (Human)
Description:
P11362
Residue:
822
  
Inhibitor
Name:
BDBM84518
Synonyms:
Sulindac analogue, 15
Type:
Small organic molecule
Emp. Form.:
C18H15FO3
Mol. Mass.:
298.3083
SMILES:
CCC1=C(CC(O)=O)c2cc(F)ccc2\C1=C/c1ccoc1
: