Target
Epidermal growth factor receptor
Ligand
BDBM84524
Substrate
Meas. Tech.
Inhibition Assay
IC50
2.2e+4± 3.6e+3 nM
Citation
 Gourzoulidou, ECarpintero, MBaumhof, PGiannis, AWaldmann, H Inhibition of angiogenesis-relevant receptor tyrosine kinases by sulindac analogues. Chembiochem 6:527-31 (2005)  
Target
Name:
Epidermal growth factor receptor
Synonyms:
EGF Receptor Substrate EGFR_HUMAN ERBB1 Epidermal Growth Factor Receptor erbB-1 Epidermal growth factor receptor (EGFR) HER1 Proto-oncogene c-ErbB-1 Tyrosine-Protein Kinase ErbB-1
Type:
Receptor Kinase Domain
Mol. Mass.:
134279.59
Organism:
Homo sapiens (Human)
Description:
P00533
Residue:
1210
  
Inhibitor
Name:
BDBM84524
Synonyms:
Sulindac analogue, 21
Type:
Small organic molecule
Emp. Form.:
C17H13BrO3
Mol. Mass.:
345.187
SMILES:
CC1=C(CC(O)=O)c2ccc(Br)cc2\C1=C/c1ccoc1
: