Target
Cyclin-dependent kinase 2
Ligand
BDBM84534
Substrate
Meas. Tech.
Inhibition Assay
pH
8±0
Temperature
295.15±0 K
IC50
5e+2±n/a nM
Citation
 Jautelat, RBrumby, TSchäfer, MBriem, HEisenbrand, GSchwahn, SKrüger, MLücking, UPrien, OSiemeister, G From the insoluble dye indirubin towards highly active, soluble CDK2-inhibitors. Chembiochem 6:531-40 (2005)  
Target
Name:
Cyclin-dependent kinase 2
Synonyms:
CDK2 CDK2_HUMAN Cell division protein kinase 2 Protein cereblon/Cyclin-dependent kinase 2 | p33 protein kinase
Type:
Enzyme Subunit
Mol. Mass.:
33938.17
Organism:
Homo sapiens (Human)
Description:
P24941
Residue:
298
  
Inhibitor
Name:
BDBM84534
Synonyms:
Indirubin derivative, 20
Type:
Small organic molecule
Emp. Form.:
C16H10N2O5S
Mol. Mass.:
342.326
SMILES:
OS(=O)(=O)c1ccc2NC(=O)C(=C3Nc4ccccc4C3=O)c2c1
: