Target
Insulin receptor
Ligand
BDBM84534
Substrate
Meas. Tech.
Inhibition Assay
pH
7.5±0
Temperature
295.15±0 K
IC50
>1.0e+4±n/a nM
Citation
 Jautelat, RBrumby, TSchäfer, MBriem, HEisenbrand, GSchwahn, SKrüger, MLücking, UPrien, OSiemeister, G From the insoluble dye indirubin towards highly active, soluble CDK2-inhibitors. Chembiochem 6:531-40 (2005)  
Target
Name:
Insulin receptor
Synonyms:
INSR INSR_HUMAN Insulin receptor beta subunit
Type:
Receptor Tyrosine Kinase
Mol. Mass.:
156322.60
Organism:
Homo sapiens (Human)
Description:
P06213
Residue:
1382
  
Inhibitor
Name:
BDBM84534
Synonyms:
Indirubin derivative, 20
Type:
Small organic molecule
Emp. Form.:
C16H10N2O5S
Mol. Mass.:
342.326
SMILES:
OS(=O)(=O)c1ccc2NC(=O)C(=C3Nc4ccccc4C3=O)c2c1
: