Target
Vascular endothelial growth factor receptor 2
Ligand
BDBM84534
Substrate
Meas. Tech.
Inhibition Assay
pH
7±0
Temperature
295.15±0 K
IC50
>1.0e+4±n/a nM
Citation
 Jautelat, RBrumby, TSchäfer, MBriem, HEisenbrand, GSchwahn, SKrüger, MLücking, UPrien, OSiemeister, G From the insoluble dye indirubin towards highly active, soluble CDK2-inhibitors. Chembiochem 6:531-40 (2005)  
Target
Name:
Vascular endothelial growth factor receptor 2
Synonyms:
CD_antigen=CD309 Fetal liver kinase 1 (FLK-1) KDR Protein-tyrosine kinase receptor Flk-1 VEGFR-2 VEGFR2 Vascular Endothelial Growth Factor Receptor Kinase 2 Vascular endothelial growth factor receptor 2 (KDR) Vascular endothelial growth factor receptor 2 (VEGFR2) Vascular endothelial growth factor receptor-2 (VEGFR-2)
Type:
Receptor Tyrosine Kinase
Mol. Mass.:
151510.97
Organism:
Homo sapiens (Human)
Description:
P35968
Residue:
1356
  
Inhibitor
Name:
BDBM84534
Synonyms:
Indirubin derivative, 20
Type:
Small organic molecule
Emp. Form.:
C16H10N2O5S
Mol. Mass.:
342.326
SMILES:
OS(=O)(=O)c1ccc2NC(=O)C(=C3Nc4ccccc4C3=O)c2c1
: