Target
Kinesin-like protein KIF11
Ligand
BDBM84577
Substrate
Meas. Tech.
Malachite Green Assay
pH
6.8±0
Temperature
298.15±0 K
IC50
2.73e+3± 5.1e+2 nM
Citation
 Sarli, VHuemmer, SSunder-Plassmann, NMayer, TUGiannis, A Synthesis and biological evaluation of novel EG5 inhibitors. Chembiochem 6:2005-13 (2005)  
Target
Name:
Kinesin-like protein KIF11
Synonyms:
EG5 KIF11_HUMAN Kinesin Spindle Protein Eg5 TRIP5 | kinesin spindle protein
Type:
PROTEIN
Mol. Mass.:
119138.97
Organism:
Homo sapiens (Human)
Description:
ChEMBL_1457426
Residue:
1056
  
Inhibitor
Name:
BDBM84577
Synonyms:
VS-94
Type:
Small organic molecule
Emp. Form.:
C15H14N2OS
Mol. Mass.:
270.349
SMILES:
Cc1ccc2NC(=S)NC(c3cccc(O)c3)c2c1
: