Target
Somatostatin receptor type 1
Ligand
BDBM50097783
Substrate
Ki
15.3±n/a nM
Comments
PDSP_3355
Citation
 Patel, YCSrikant, CB Subtype selectivity of peptide analogs for all five cloned human somatostatin receptors (hsstr 1-5). Endocrinology 135:2814-7 (1994)  
Target
Name:
Somatostatin receptor type 1
Synonyms:
SOMATOSTATIN SST1 SS-1-R SS1R SSTR1 | Somatostatin receptor type 1 (SSTR1)
Type:
Enzyme
Mol. Mass.:
42692.81
Organism:
Homo sapiens (Human)
Description:
P30872
Residue:
391
  
Inhibitor
Name:
BDBM50097783
Synonyms:
CHEMBL438401 SOMATOSTATIN | SRIF-D-Trp8
Type:
Small organic molecule
Emp. Form.:
C76H104N18O19S2
Mol. Mass.:
1637.878
SMILES:
C[C@@H](O)[C@@H]1NC(=O)[C@@H](Cc2ccccc2)NC(=O)[C@@H](NC(=O)[C@@H](CCCCN)NC(=O)[C@H](Cc2c[nH]c3ccccc23)NC(=O)[C@@H](Cc2ccccc2)NC(=O)[C@H](Cc2ccccc2)NC(=O)[C@@H](CC(N)=O)NC(=O)[C@H](CCCCN)NC(=O)[C@H](CSSC[C@@H](NC(=O)[C@@H](CO)NC1=O)C(O)=O)NC(=O)CNC(=O)[C@H](C)N)C(C)O
: