Target
Somatostatin receptor type 4
Ligand
BDBM82459
Substrate
Ki
8.3±n/a nM
Comments
PDSP_387
Citation
 Patel, YCSrikant, CB Subtype selectivity of peptide analogs for all five cloned human somatostatin receptors (hsstr 1-5). Endocrinology 135:2814-7 (1994)  
Target
Name:
Somatostatin receptor type 4
Synonyms:
SOMATOSTATIN SST4 SS4-R SSR4_HUMAN SSTR4 | Somatostatin receptor type 4 (SSTR4)
Type:
Enzyme
Mol. Mass.:
42015.38
Organism:
Homo sapiens (Human)
Description:
P31391
Residue:
388
  
Inhibitor
Name:
BDBM82459
Synonyms:
BIM 23058 D-Phe-L-Phe-L-Tyr-D-Trp-L-Lys-L-Val-L-Phe-L-Thr-NH2
Type:
Small organic molecule
Emp. Form.:
C62H77N11O10
Mol. Mass.:
1136.3425
SMILES:
CC(C)[C@H](NC(=O)[C@H](CCCCN)NC(=O)[C@@H](Cc1c[nH]c2ccccc12)NC(=O)[C@H](Cc1ccc(O)cc1)NC(=O)[C@H](Cc1ccccc1)NC(=O)[C@H](N)Cc1ccccc1)C(=O)N[C@@H](Cc1ccccc1)C(=O)N[C@@H]([C@@H](C)O)C(N)=O
: