Target
Bromodomain-containing protein 4 [44-477]
Ligand
BDBM274211
Substrate
Meas. Tech.
TR-FRET In-Vitro Binding Assay
pH
7.5±n/a
IC50
24.0±n/a nM
Comments
extracted
Citation
 Rueger, HBlank, JBordas, VCotesta, SBold, GGuagnano, VVaupel, A Pyrrolopyrrolone derivatives and their use as BET inhibitors US Patent  US9550796 Publication Date 1/24/2017 
Target
Name:
Bromodomain-containing protein 4 [44-477]
Synonyms:
BRD4 Bromodomain-containing protein 4 | HUNK1
Type:
Enzyme Catalytic Domain (aa 44-477)
Mol. Mass.:
48692.13
Organism:
Homo sapiens (Human)
Description:
O60885[44-477]
Residue:
434
  
Inhibitor
Name:
BDBM274211
Synonyms:
6-(4-chlorophenyl)-5-(3,8-di methyl-[1,2,4]triazolo[4,3-a]pyridin-6-yl)-3-methyl-1-(1-methylazetidin-3-yl)-5,6-dihydropyrrolo[3,4-b]pyrrol-4(1H)-one | US9550796, Example 5
Type:
Small organic molecule
Emp. Form.:
C25H25ClN6O
Mol. Mass.:
460.959
SMILES:
CN1CC(C1)n1cc(C)c2C(=O)N(C(c12)c1ccc(Cl)cc1)c1cc(C)c2nnc(C)n2c1
: