Target
Bromodomain-containing protein 4 [44-477]
Ligand
BDBM274214
Substrate
Meas. Tech.
TR-FRET In-Vitro Binding Assay
pH
7.5±n/a
IC50
18.0±n/a nM
Comments
extracted
Citation
 Rueger, HBlank, JBordas, VCotesta, SBold, GGuagnano, VVaupel, A Pyrrolopyrrolone derivatives and their use as BET inhibitors US Patent  US9550796 Publication Date 1/24/2017 
Target
Name:
Bromodomain-containing protein 4 [44-477]
Synonyms:
BRD4 Bromodomain-containing protein 4 | HUNK1
Type:
Enzyme Catalytic Domain (aa 44-477)
Mol. Mass.:
48692.13
Organism:
Homo sapiens (Human)
Description:
O60885[44-477]
Residue:
434
  
Inhibitor
Name:
BDBM274214
Synonyms:
Ethyl 3-(6-(4-chlorophenyl)-5-(3,8-dimethyl-[1,2,4]triazolo[4,3-a]pyridin-6-yl)-3-methyl-4-oxo-5,6-dihydropyrrolo[3,4-b]pyrrol-1(4H)-yl)azetidine-1-carboxylate | US9550796, Example 8
Type:
Small organic molecule
Emp. Form.:
C27H27ClN6O3
Mol. Mass.:
518.995
SMILES:
CCOC(=O)N1CC(C1)n1cc(C)c2C(=O)N(C(c12)c1ccc(Cl)cc1)c1cc(C)c2nnc(C)n2c1
: