Target
Bromodomain-containing protein 4 [44-477]
Ligand
BDBM274249
Substrate
Meas. Tech.
TR-FRET In-Vitro Binding Assay
pH
7.5±n/a
IC50
14.0±n/a nM
Comments
extracted
Citation
 Rueger, HBlank, JBordas, VCotesta, SBold, GGuagnano, VVaupel, A Pyrrolopyrrolone derivatives and their use as BET inhibitors US Patent  US9550796 Publication Date 1/24/2017 
Target
Name:
Bromodomain-containing protein 4 [44-477]
Synonyms:
BRD4 Bromodomain-containing protein 4 | HUNK1
Type:
Enzyme Catalytic Domain (aa 44-477)
Mol. Mass.:
48692.13
Organism:
Homo sapiens (Human)
Description:
O60885[44-477]
Residue:
434
  
Inhibitor
Name:
BDBM274249
Synonyms:
6-(4-chlorophenyl)-5-(1,5-dimethyl-6-oxo-1,6-dihydropyridin-3-yl)-1-methyl-2-(1-methyl-6-oxo-1,6-dihydropyridin-3-yl)-5,6-dihydropyrrolo[3,4-b]pyrrol-4(1H)-one | US9550796, Example 46
Type:
Small organic molecule
Emp. Form.:
C26H23ClN4O3
Mol. Mass.:
474.939
SMILES:
Cc1cc(cn(C)c1=O)N1C(c2c(cc(-c3ccc(=O)n(C)c3)n2C)C1=O)c1ccc(Cl)cc1
: