Target
Bromodomain-containing protein 4 [44-477]
Ligand
BDBM274273
Substrate
Meas. Tech.
TR-FRET In-Vitro Binding Assay
pH
7.5±n/a
IC50
23.0±n/a nM
Comments
extracted
Citation
 Rueger, HBlank, JBordas, VCotesta, SBold, GGuagnano, VVaupel, A Pyrrolopyrrolone derivatives and their use as BET inhibitors US Patent  US9550796 Publication Date 1/24/2017 
Target
Name:
Bromodomain-containing protein 4 [44-477]
Synonyms:
BRD4 Bromodomain-containing protein 4 | HUNK1
Type:
Enzyme Catalytic Domain (aa 44-477)
Mol. Mass.:
48692.13
Organism:
Homo sapiens (Human)
Description:
O60885[44-477]
Residue:
434
  
Inhibitor
Name:
BDBM274273
Synonyms:
5-(5-chloro-1-methyl-6-oxo-1,6-dihydropyridin-3-yl)-6-(4-chlorophenyl)-1,2-dimethyl-5,6-dihydropyrrolo[3,4-b]pyrrol-4(1H)-one | US9550796, Example 74
Type:
Small organic molecule
Emp. Form.:
C20H17Cl2N3O2
Mol. Mass.:
402.274
SMILES:
Cc1cc2C(=O)N(C(c2n1C)c1ccc(Cl)cc1)c1cc(Cl)c(=O)n(C)c1
: