Target
Bromodomain-containing protein 4 [44-477]
Ligand
BDBM274293
Substrate
Meas. Tech.
TR-FRET In-Vitro Binding Assay
pH
7.5±n/a
IC50
12.0±n/a nM
Comments
extracted
Citation
 Rueger, HBlank, JBordas, VCotesta, SBold, GGuagnano, VVaupel, A Pyrrolopyrrolone derivatives and their use as BET inhibitors US Patent  US9550796 Publication Date 1/24/2017 
Target
Name:
Bromodomain-containing protein 4 [44-477]
Synonyms:
BRD4 Bromodomain-containing protein 4 | HUNK1
Type:
Enzyme Catalytic Domain (aa 44-477)
Mol. Mass.:
48692.13
Organism:
Homo sapiens (Human)
Description:
O60885[44-477]
Residue:
434
  
Inhibitor
Name:
BDBM274293
Synonyms:
6-(4-chlorophenyl)-5-(3,7-dimethyl-3H-[1,2,3]triazolo[4,5-b]pyridin-5-yl)-N,N,1-trimethyl-4-oxo-1,4,5,6-tetrahydropyrrolo[3,4-b]pyrrole-3-carboxamide | US9550796, Example 94
Type:
Small organic molecule
Emp. Form.:
C23H22ClN7O2
Mol. Mass.:
463.919
SMILES:
CN(C)C(=O)c1cn(C)c2C(N(C(=O)c12)c1cc(C)c2nnn(C)c2n1)c1ccc(Cl)cc1
: