Target
Bromodomain-containing protein 4 [44-477]
Ligand
BDBM274294
Substrate
Meas. Tech.
TR-FRET In-Vitro Binding Assay
pH
7.5±n/a
IC50
16.0±n/a nM
Comments
extracted
Citation
 Rueger, HBlank, JBordas, VCotesta, SBold, GGuagnano, VVaupel, A Pyrrolopyrrolone derivatives and their use as BET inhibitors US Patent  US9550796 Publication Date 1/24/2017 
Target
Name:
Bromodomain-containing protein 4 [44-477]
Synonyms:
BRD4 Bromodomain-containing protein 4 | HUNK1
Type:
Enzyme Catalytic Domain (aa 44-477)
Mol. Mass.:
48692.13
Organism:
Homo sapiens (Human)
Description:
O60885[44-477]
Residue:
434
  
Inhibitor
Name:
BDBM274294
Synonyms:
Tert-butyl (6-(4-chlorophenyl)-5-(3,7-dimethyl-3H-[1,2,3]triazolo[4,5-b]pyridin-5-yl)-1-methyl-4-oxo-1,4,5,6-tetrahydropyrrolo[3,4-b]pyrrol-3-yl)carbamate | US9550796, Example 95
Type:
Small organic molecule
Emp. Form.:
C25H26ClN7O3
Mol. Mass.:
507.972
SMILES:
Cc1cc(nc2n(C)nnc12)N1C(c2c(C1=O)c(NC(=O)OC(C)(C)C)cn2C)c1ccc(Cl)cc1
: