Target
Bromodomain-containing protein 4 [44-477]
Ligand
BDBM274307
Substrate
Meas. Tech.
TR-FRET In-Vitro Binding Assay
pH
7.5±n/a
IC50
16.0±n/a nM
Comments
extracted
Citation
 Rueger, HBlank, JBordas, VCotesta, SBold, GGuagnano, VVaupel, A Pyrrolopyrrolone derivatives and their use as BET inhibitors US Patent  US9550796 Publication Date 1/24/2017 
Target
Name:
Bromodomain-containing protein 4 [44-477]
Synonyms:
BRD4 Bromodomain-containing protein 4 | HUNK1
Type:
Enzyme Catalytic Domain (aa 44-477)
Mol. Mass.:
48692.13
Organism:
Homo sapiens (Human)
Description:
O60885[44-477]
Residue:
434
  
Inhibitor
Name:
BDBM274307
Synonyms:
6-(4-chlorophenyl)-5-(3-(difluoromethyl)-8-methyl-[1,2,4]triazolo[4,3-b]pyridazin-6-yl)-N,1-dimethyl-4-oxo-1,4,5,6-tetrahydropyrrolo[3,4-b]pyrrole-3-carboxamide | US9550796, Example 108
Type:
Small organic molecule
Emp. Form.:
C22H18ClF2N7O2
Mol. Mass.:
485.874
SMILES:
CNC(=O)c1cn(C)c2C(N(C(=O)c12)c1cc(C)c2nnc(C(F)F)n2n1)c1ccc(Cl)cc1
: