Target
Bromodomain-containing protein 3
Ligand
BDBM274319
Substrate
Meas. Tech.
TR-FRET In-Vitro Binding Assay
pH
7.5±n/a
IC50
<11.0±n/a nM
Comments
extracted
Citation
 Rueger, HBlank, JBordas, VCotesta, SBold, GGuagnano, VVaupel, A Pyrrolopyrrolone derivatives and their use as BET inhibitors US Patent  US9550796 Publication Date 1/24/2017 
Target
Name:
Bromodomain-containing protein 3
Synonyms:
BRD3 Bromodomain and extra-terminal motif (BET) Bromodomain-containing protein 3 (BRD3) RING3-like protein | RING3L
Type:
Protein
Mol. Mass.:
79571.81
Organism:
Homo sapiens (Human)
Description:
Q15059
Residue:
726
  
Inhibitor
Name:
BDBM274319
Synonyms:
6-(4-chlorophenyl)-3-cyclopropyl-5-(3,8-di methyl-[1,2,4]triazolo[4,3-a]pyridin-6-yl)-2-(2-methoxypyridin-3-yl)-1-methyl-5,6-dihydropyrrolo[3,4-b]pyrrol-4(1H)-one | US9550796, Example 120
Type:
Small organic molecule
Emp. Form.:
C30H27ClN6O2
Mol. Mass.:
539.027
SMILES:
COc1ncccc1-c1c(C2CC2)c2C(=O)N(C(c2n1C)c1ccc(Cl)cc1)c1cc(C)c2nnc(C)n2c1
: