Target
Bromodomain-containing protein 4 [44-477]
Ligand
BDBM274322
Substrate
Meas. Tech.
TR-FRET In-Vitro Binding Assay
pH
7.5±n/a
IC50
<11.0±n/a nM
Comments
extracted
Citation
 Rueger, HBlank, JBordas, VCotesta, SBold, GGuagnano, VVaupel, A Pyrrolopyrrolone derivatives and their use as BET inhibitors US Patent  US9550796 Publication Date 1/24/2017 
Target
Name:
Bromodomain-containing protein 4 [44-477]
Synonyms:
BRD4 Bromodomain-containing protein 4 | HUNK1
Type:
Enzyme Catalytic Domain (aa 44-477)
Mol. Mass.:
48692.13
Organism:
Homo sapiens (Human)
Description:
O60885[44-477]
Residue:
434
  
Inhibitor
Name:
BDBM274322
Synonyms:
Ethyl 6-(4-chlorophenyl)-2-(3,6-dihydro-2H-pyran-4-yl)-5-(3,8-dimethyl-[1,2,4]triazolo[4,3-a]pyridin-6-yl)-3-methyl-4-oxo-5,6-dihydropyrrolo[3,4-b]pyrrole-1(4H)-carboxylate | US9550796, Example 123
Type:
Small organic molecule
Emp. Form.:
C29H28ClN5O4
Mol. Mass.:
546.017
SMILES:
CCOC(=O)n1c2C(N(C(=O)c2c(C)c1C1=CCOCC1)c1cc(C)c2nnc(C)n2c1)c1ccc(Cl)cc1
: