Target
Bromodomain-containing protein 4 [44-477]
Ligand
BDBM274329
Substrate
Meas. Tech.
TR-FRET In-Vitro Binding Assay
pH
7.5±n/a
IC50
12.0±n/a nM
Comments
extracted
Citation
 Rueger, HBlank, JBordas, VCotesta, SBold, GGuagnano, VVaupel, A Pyrrolopyrrolone derivatives and their use as BET inhibitors US Patent  US9550796 Publication Date 1/24/2017 
Target
Name:
Bromodomain-containing protein 4 [44-477]
Synonyms:
BRD4 Bromodomain-containing protein 4 | HUNK1
Type:
Enzyme Catalytic Domain (aa 44-477)
Mol. Mass.:
48692.13
Organism:
Homo sapiens (Human)
Description:
O60885[44-477]
Residue:
434
  
Inhibitor
Name:
BDBM274329
Synonyms:
3-(azetidin-3-yl)-6-(4-chlorophenyl)-5-(3,7-dimethyl-3H-[1,2,3]triazolo[4,5-b]pyridin-5-yl)-1-methyl-5,6-dihydropyrrolo[3,4-b]pyrrol-4(1H)-one | US9550796, Example 130
Type:
Small organic molecule
Emp. Form.:
C23H22ClN7O
Mol. Mass.:
447.92
SMILES:
Cc1cc(nc2n(C)nnc12)N1C(c2c(C1=O)c(cn2C)C1CNC1)c1ccc(Cl)cc1
: