Target
Bromodomain-containing protein 4 [44-477]
Ligand
BDBM274336
Substrate
Meas. Tech.
TR-FRET In-Vitro Binding Assay
pH
7.5±n/a
IC50
<11.0±n/a nM
Comments
extracted
Citation
 Rueger, HBlank, JBordas, VCotesta, SBold, GGuagnano, VVaupel, A Pyrrolopyrrolone derivatives and their use as BET inhibitors US Patent  US9550796 Publication Date 1/24/2017 
Target
Name:
Bromodomain-containing protein 4 [44-477]
Synonyms:
BRD4 Bromodomain-containing protein 4 | HUNK1
Type:
Enzyme Catalytic Domain (aa 44-477)
Mol. Mass.:
48692.13
Organism:
Homo sapiens (Human)
Description:
O60885[44-477]
Residue:
434
  
Inhibitor
Name:
BDBM274336
Synonyms:
(R)-6-(4-chlorophenyl)-2-(3,6-dihydro-2H-pyran-4-yl)-5-(3,8-dimethyl-[1,2,4]triazolo[4,3-a]pyridin-6-yl)-1-methyl-5,6-dihydropyrrolo[3,4-b]pyrrol-4(1H)-one | US9550796, Example 137
Type:
Small organic molecule
Emp. Form.:
C26H24ClN5O2
Mol. Mass.:
473.954
SMILES:
Cc1nnc2c(C)cc(cn12)N1[C@H](c2c(cc(C3=CCOCC3)n2C)C1=O)c1ccc(Cl)cc1
: