Target
Adenosine receptor A2b
Ligand
BDBM50009525
Substrate
Ki
6918.3±n/a nM
Comments
PDSP_62
Citation
 Barrett, RJMay, JMMartin, PLMiller, JR In vitro and in vivo pharmacological characterization of N6-cyclopentyl-9-methyladenine (N-0840): a selective, orally active A1 adenosine receptor antagonist. J Pharmacol Exp Ther 265:227-36 (1993) Target
Name:
Adenosine receptor A2b
Synonyms:
AA2BR_BOVIN ADORA2B
Type:
Enzyme Catalytic Domain
Mol. Mass.:
36398.35
Organism:
BOVINE
Description:
ADENOSINE A2 0 BOVINE::Q1LZD0
Residue:
332
  
Inhibitor
Name:
BDBM50009525
Synonyms:
2-CI Adenosine 2-Chloroado CHEMBL285819
Type:
Small organic molecule
Emp. Form.:
C10H12ClN5O4
Mol. Mass.:
301.686
SMILES:
Nc1nc(Cl)nc2n(cnc12)[C@@H]1O[C@H](CO)[C@@H](O)[C@H]1O
: