Target
D(1A) dopamine receptor
Ligand
BDBM82247
Substrate
Ki
>10000±n/a nM
Comments
PDSP_1685
Citation
 Barrett, RJMay, JMMartin, PLMiller, JR In vitro and in vivo pharmacological characterization of N6-cyclopentyl-9-methyladenine (N-0840): a selective, orally active A1 adenosine receptor antagonist. J Pharmacol Exp Ther 265:227-36 (1993) Target
Name:
D(1A) dopamine receptor
Synonyms:
D(1A) dopamine receptor DOPAMINE D1 DRD1_BOVIN | Dopamine receptor
Type:
Enzyme Catalytic Domain
Mol. Mass.:
49330.65
Organism:
BOVINE
Description:
DOPAMINE D1 DRD1 BOVINE::Q95136
Residue:
446
  
Inhibitor
Name:
BDBM82247
Synonyms:
8-Chloro-3-methyl-5-phenyl-2,3,4,5-tetrahydro-1H-benzo[d]azepin-7-ol(SCH 23390) CHEMBL2158641 SCH 23388 SCH 23390 (R-enantiomer) | SCH 23390,R(+)
Type:
Small organic molecule
Emp. Form.:
C17H18ClNO
Mol. Mass.:
287.784
SMILES:
CN1CCc2cc(Cl)c(O)cc2[C@H](C1)c1ccccc1
: