Target
Gag-Pol polyprotein [588-1027]/[588-1147]
Ligand
BDBM2419
Substrate
poly(rC)-oligo(dG)(12-18)
Meas. Tech.
HIV-1 RT Assay
IC50
1500±n/a nM
Citation
 Silvestri, RArtico, MMassa, SMarceddu, TDe Montis, FLa Colla, P 1-[2-(Diphenylmethoxy)ethyl]-2-methyl-5-nitroimidazole: a potent lead for the design of novel NNRTIs. Bioorg Med Chem Lett 10:253-6 (2000)  
Target
Name:
Gag-Pol polyprotein [588-1027]/[588-1147]
Synonyms:
EC: 2.7.7.49 | HIV-1 Reverse Transcriptase
Type:
Protein Complex
Mol. Mass.:
115684
Description:
Components:
This complex has 2 components.
Component 1
Name:
Gag-Pol polyprotein [588-1147]
Synonyms:
HIV-1 Reverse Transcriptase Chain A gag-pol
Type:
Enzyme Subunit
Mol. Mass.:
64486.41
Organism:
Human immunodeficiency virus type 1
Description:
P04585[588-1147]
Residue:
560
  
Component 2
Name:
Gag-Pol polyprotein [588-1027]
Synonyms:
HIV-1 Reverse Transcriptase Chain B gag-pol
Type:
Enzyme Subunit
Mol. Mass.:
51337.13
Organism:
Human immunodeficiency virus type 1
Description:
P04585[588-1027]
Residue:
440
  
Inhibitor
Name:
BDBM2419
Synonyms:
1-{2-[(4-tert-butylphenyl)(phenyl)methoxy]ethyl}-2-methyl-5-nitro-1H-imidazole | Diarylmethoxyethylmethylnitroimidazole (DAMNI) 6f
Type:
Small organic molecule
Emp. Form.:
C23H27N3O3
Mol. Mass.:
393.4788
SMILES:
Cc1ncc(n1CCOC(c1ccccc1)c1ccc(cc1)C(C)(C)C)[N+]([O-])=O
:
Substrate
Name:
poly(rC)-oligo(dG)(12-18)
Synonyms:
Type:
RNA/DNA duplex
Mol. Mass.:
358.43
Organism:
Description:
The incorporation of Tritium-labeled dGTP onto a poly(rC)-oligo(dG)(12-18) template-primer
Residue:
3
NA