Target
G-protein coupled receptor 84
Ligand
BDBM50239181
Substrate
Meas. Tech.
ChEMBL_1665423 (CHEMBL4015219)
EC50
>10000±n/a nM
Citation
 Pillaiyar, TKöse, MSylvester, KWeighardt, HThimm, DBorges, GFörster, Ivon Kügelgen, IMüller, CE Diindolylmethane Derivatives: Potent Agonists of the Immunostimulatory Orphan G Protein-Coupled Receptor GPR84. J Med Chem 60:3636-3655 (2017)  
Target
Name:
G-protein coupled receptor 84
Synonyms:
EX33 GPR84 Inflammation-related G-protein coupled receptor EX33
Type:
PROTEIN
Mol. Mass.:
43726.73
Organism:
Homo sapiens (Human)
Description:
ChEMBL_116040
Residue:
396
  
Inhibitor
Name:
BDBM50239181
Synonyms:
1,1,1-Tris(3-Indolyl)Methane | CHEMBL522998
Type:
Small organic molecule
Emp. Form.:
C25H19N3
Mol. Mass.:
361.4385
SMILES:
c1[nH]c2ccccc2c1C(c1c[nH]c2ccccc12)c1c[nH]c2ccccc12
: