Target
G-protein coupled receptor 84
Ligand
BDBM50239202
Substrate
Meas. Tech.
ChEMBL_1665423 (CHEMBL4015219)
EC50
>10000±n/a nM
Citation
 Pillaiyar, TKöse, MSylvester, KWeighardt, HThimm, DBorges, GFörster, Ivon Kügelgen, IMüller, CE Diindolylmethane Derivatives: Potent Agonists of the Immunostimulatory Orphan G Protein-Coupled Receptor GPR84. J Med Chem 60:3636-3655 (2017)  
Target
Name:
G-protein coupled receptor 84
Synonyms:
EX33 GPR84 Inflammation-related G-protein coupled receptor EX33
Type:
PROTEIN
Mol. Mass.:
43726.73
Organism:
Homo sapiens (Human)
Description:
ChEMBL_116040
Residue:
396
  
Inhibitor
Name:
BDBM50239202
Synonyms:
CHEMBL4087988
Type:
Small organic molecule
Emp. Form.:
C18H13FN2O2
Mol. Mass.:
308.3064
SMILES:
COc1ccc2[nH]cc(C=C3C(=O)Nc4ccc(F)cc34)c2c1
: