Target
Mu-type opioid receptor
Ligand
BDBM50001683
Substrate
Meas. Tech.
ChEMBL_146696 (CHEMBL753773)
Ki
82±n/a nM
Citation
 Froimowitz, MPick, CGPasternak, GW Phenylmorphans and analogues: opioid receptor subtype selectivity and effect of conformation on activity. J Med Chem 35:1521-5 (1992)  
Target
Name:
Mu-type opioid receptor
Synonyms:
MOR-1 OPIATE Mu OPRM_BOVIN
Type:
Enzyme Catalytic Domain
Mol. Mass.:
45038.37
Organism:
CALF
Description:
OPIATE Mu 2 0 CALF::P79350
Residue:
401
  
Inhibitor
Name:
BDBM50001683
Synonyms:
13-[2-Amino-3-(4-hydroxy-phenyl)-propionylamino]-7-benzyl-3,3,14,14-tetramethyl-6,9,12-trioxo-1,2-dithia-5,8,11-triaza-cyclotetradecane-4-carboxylic acid CHEMBL294616 | DPDPE
Type:
Small organic molecule
Emp. Form.:
C30H39N5O7S2
Mol. Mass.:
645.79
SMILES:
CC1(C)SSC(C)(C)[C@@H](NC(=O)[C@@H](N)Cc2ccc(O)cc2)C(=O)NCC(=O)N[C@H](Cc2ccccc2)C(=O)N[C@H]1C(O)=O
: