Target
Cytochrome P450 11B2, mitochondrial
Ligand
BDBM50444549
Substrate
Meas. Tech.
ChEBML_1667113
IC50
0.200000±n/a nM
Citation
 Emmerich, Jvan Koppen, CJBurkhart, JLHu, QSiebenbürger, LBoerger, CScheuer, CLaschke, MWMenger, MDHartmann, RW Lead Optimization Generates CYP11B1 Inhibitors of Pyridylmethyl Isoxazole Type with Improved Pharmacological Profile for the Treatment of Cushing's Disease. J Med Chem 60:5086-5098 (2017)  
Target
Name:
Cytochrome P450 11B2, mitochondrial
Synonyms:
Aldosterone Synthase (CYP11B2) Aldosterone-synthesizing enzyme CYP11B2 Cytochrome P450 11B2 Cytochrome P450 11B2, mitochondrial P-450C18 | Steroid 18-hydroxylase
Type:
Protein
Mol. Mass.:
57582.15
Organism:
Homo sapiens (Human)
Description:
P19099
Residue:
503
  
Inhibitor
Name:
BDBM50444549
Synonyms:
CHEMBL3099695
Type:
Small organic molecule
Emp. Form.:
C13H10FN3
Mol. Mass.:
227.237
SMILES:
Fc1cc(ccc1[C@H]1CCc2cncn12)C#N
: