Target
Calcitonin gene-related peptide type 1 receptor
Ligand
BDBM50453179
Substrate
Meas. Tech.
ChEBML_42602
IC50
0.900000±n/a nM
Citation
 Mimeault, MQuirion, RDumont, YSt-Pierre, SFournier, A Structure-activity study of hCGRP8-37, a calcitonin gene-related peptide receptor antagonist. J Med Chem 35:2163-8 (1992)  
Target
Name:
Calcitonin gene-related peptide type 1 receptor
Synonyms:
CALRL_RAT Calcrl | Cgrpr
Type:
PROTEIN
Mol. Mass.:
53330.91
Organism:
Rattus norvegicus
Description:
ChEMBL_1457286
Residue:
464
  
Inhibitor
Name:
BDBM50453179
Synonyms:
CHEMBL2369463
Type:
Small organic molecule
Emp. Form.:
C134H221N43O37
Mol. Mass.:
3026.4544
SMILES:
CC(C)C[C@H](NC(=O)CNC(=O)[C@H](C)NC(=O)[C@H](CC(C)C)NC(=O)[C@H](CCCN=C(N)N)NC(=O)[C@H](Cc1c[nH]cn1)NC(=O)[C@@H](N)[C@@H](C)O)C(=O)N[C@@H](CC(C)C)C(=O)N[C@@H](CO)C(=O)N[C@@H](CCCN=C(N)N)C(=O)N[C@@H](CO)C(=O)NCC(=O)NCC(=O)N[C@@H](C(C)C)C(=O)N[C@@H](C(C)C)C(=O)N[C@@H](CCCCN)C(=O)N[C@@H](CC(N)=O)C(=O)N[C@@H](CC(N)=O)C(=O)N[C@@H](Cc1ccccc1)C(=O)N[C@@H](C(C)C)C(=O)N1CCC[C@H]1C(=O)N[C@@H]([C@@H](C)O)C(=O)N[C@@H](CC(N)=O)C(=O)N[C@@H](C(C)C)C(=O)NCC(=O)N[C@@H](CO)C(=O)N[C@@H](CCCCN)C(=O)N[C@@H](C)C(=O)N[C@@H](Cc1ccccc1)C(N)=O
: