Target
Bile salt export pump
Ligand
BDBM50151860
Substrate
Meas. Tech.
ChEMBL_1667662 (CHEMBL4017550)
IC50
>1000000±n/a nM
Citation
 Warner, DJChen, HCantin, LDKenna, JGStahl, SWalker, CLNoeske, T Mitigating the inhibition of human bile salt export pump by drugs: opportunities provided by physicochemical property modulation, in silico modeling, and structural modification. Drug Metab Dispos 40:2332-41 (2012)  
Target
Name:
Bile salt export pump
Synonyms:
ABCB11 ATP-binding cassette sub-family B member 11 Bile Salt Export Pump, BSEP Bile salt export pump (BSEP)
Type:
Protein
Mol. Mass.:
146405.49
Organism:
Homo sapiens (Human)
Description:
O95342
Residue:
1321
  
Inhibitor
Name:
BDBM50151860
Synonyms:
4-Acetylamino-N-(2-diethylamino-ethyl)-benzamide CHEMBL1097 N-acetylprocainamide
Type:
Small organic molecule
Emp. Form.:
C15H23N3O2
Mol. Mass.:
277.362
SMILES:
CCN(CC)CCNC(=O)c1ccc(NC(C)=O)cc1
: