Target
Bile salt export pump
Ligand
BDBM50240077
Substrate
Meas. Tech.
ChEMBL_1667662 (CHEMBL4017550)
IC50
<10000±n/a nM
Citation
 Warner, DJChen, HCantin, LDKenna, JGStahl, SWalker, CLNoeske, T Mitigating the inhibition of human bile salt export pump by drugs: opportunities provided by physicochemical property modulation, in silico modeling, and structural modification. Drug Metab Dispos 40:2332-41 (2012)  
Target
Name:
Bile salt export pump
Synonyms:
ABCB11 ATP-binding cassette sub-family B member 11 Bile Salt Export Pump, BSEP Bile salt export pump (BSEP)
Type:
Protein
Mol. Mass.:
146405.49
Organism:
Homo sapiens (Human)
Description:
O95342
Residue:
1321
  
Inhibitor
Name:
BDBM50240077
Synonyms:
CHEMBL4069683
Type:
Small organic molecule
Emp. Form.:
C20H17N3O2S
Mol. Mass.:
363.433
SMILES:
COc1ccnc(c1)-c1cccc(C)c1[S+]([O-])c1nc2ccccc2[nH]1
: