Target
Phosphatidylinositol 4,5-bisphosphate 3-kinase catalytic subunit gamma isoform
Ligand
BDBM50240320
Substrate
Meas. Tech.
ChEMBL_1668121 (CHEMBL4018009)
Ki
>490±n/a nM
Citation
 Martínez González, SRodríguez-Arístegui, SHernández, AIVarela, CGonzález Cantalapiedra, EÁlvarez, RMRodríguez Hergueta, ABischoff, JRAlbarrán, MICebriá, ACendón, ECebrián, DAlfonso, PPastor, J Generation of tricyclic imidazo[1,2-a]pyrazines as novel PI3K inhibitors by application of a conformational restriction strategy. Bioorg Med Chem Lett 27:2536-2543 (2017)  
Target
Name:
Phosphatidylinositol 4,5-bisphosphate 3-kinase catalytic subunit gamma isoform
Synonyms:
PI3-kinase p110 subunit gamma PI3Kgamma PK3CG_HUMAN Phosphatidylinositol 4,5-bisphosphate 3-kinase (PI3K) Phosphatidylinositol 4,5-bisphosphate 3-kinase catalytic subunit gamma (PI3Kgamma) Phosphatidylinositol 4,5-bisphosphate 3-kinase catalytic subunit gamma isoform (PI3K) Phosphatidylinositol-4,5-bisphosphate 3-kinase catalytic subunit gamma isoform Phosphoinositide 3-kinases gamma (PI3K gamma) p120-PI3K
Type:
Enzyme Subunit
Mol. Mass.:
126470.30
Organism:
Homo sapiens (Human)
Description:
P48736
Residue:
1102
  
Inhibitor
Name:
BDBM50240320
Synonyms:
CHEMBL4088855
Type:
Small organic molecule
Emp. Form.:
C23H23FN8O
Mol. Mass.:
446.4801
SMILES:
Nc1ncc(cn1)-c1cn2c3CCN(Cc3nc2c(n1)N1CCOCC1)c1ccc(F)cc1
: