Target
Oxytocin receptor
Ligand
BDBM50001357
Substrate
Meas. Tech.
ChEBML_149059
IC50
5700±n/a nM
Citation
 Evans, BELeighton, JLRittle, KEGilbert, KFLundell, GFGould, NPHobbs, DWDiPardo, RMVeber, DFPettibone, DJ Orally active, nonpeptide oxytocin antagonists. J Med Chem 35:3919-27 (1992)  
Target
Name:
Oxytocin receptor
Synonyms:
OT-R Otr Oxytocin
Type:
Enzyme Catalytic Domain
Mol. Mass.:
42889.28
Organism:
RAT
Description:
Oxytocin OXTR RAT::P70536
Residue:
388
  
Inhibitor
Name:
BDBM50001357
Synonyms:
1'-(4-methylphenylsulfonyl)spiro[2,3-dihydro-1H-indene-1,4'-(hexahydropyridine)] | CHEMBL127117
Type:
Small organic molecule
Emp. Form.:
C20H23NO2S
Mol. Mass.:
341.467
SMILES:
Cc1ccc(cc1)S(=O)(=O)N1CCC2(CCc3ccccc23)CC1
: