Target
Vasopressin V1a/V1b/V2 receptor
Ligand
BDBM50001383
Substrate
Meas. Tech.
ChEBML_211078
IC50
>100000±n/a nM
Citation
 Evans, BELeighton, JLRittle, KEGilbert, KFLundell, GFGould, NPHobbs, DWDiPardo, RMVeber, DFPettibone, DJ Orally active, nonpeptide oxytocin antagonists. J Med Chem 35:3919-27 (1992)  
Target
Name:
Vasopressin V1a/V1b/V2 receptor
Synonyms:
Vasopressin receptor
Type:
Mol. Mass.:
Description:
ASSAY_ID of ChEMBL is 211078
Components:
This complex has 3 components.
Component 1
Name:
Vasopressin V1a receptor
Synonyms:
Avpr1a VASOPRESSIN V1A Vasopressin V1a receptor | Vasopressin receptor
Type:
Enzyme Catalytic Domain
Mol. Mass.:
47674.81
Organism:
RAT
Description:
VASOPRESSIN V1A AVPR1A RAT::P30560
Residue:
424
  
Component 2
Name:
Vasopressin V2 receptor
Synonyms:
AVPR V2 Avpr2 V2R_RAT Vasopressin receptor
Type:
G-protein coupled receptor
Mol. Mass.:
40761.85
Organism:
Rattus norvegicus (Rat)
Description:
Residue:
371
  
Component 3
Name:
Vasopressin V1b receptor
Synonyms:
Avpr1b VASOPRESSIN V1B Vasopressin receptor
Type:
Enzyme Catalytic Domain
Mol. Mass.:
47104.48
Organism:
RAT
Description:
VASOPRESSIN V1B AVPR1B RAT::P48974
Residue:
425
  
Inhibitor
Name:
BDBM50001383
Synonyms:
2-[2-hydroxy-7,7-dimethyl-1-spiro[1H-indene-1,4'-(hexahydropyridine)]-1-ylsulfonylmethylbicyclo[2.2.1]hept-2-yl]propanoic acid | CHEMBL419422
Type:
Small organic molecule
Emp. Form.:
C26H35NO5S
Mol. Mass.:
473.625
SMILES:
CC(C(O)=O)[C@@]1(O)CC2CC[C@]1(CS(=O)(=O)N1CCC3(CC1)C=Cc1ccccc31)C2(C)C
: